Custom Query (122 matches)

Filters
 
Or
 
  
 
Columns

Show under each result:


Results (22 - 24 of 122)

1 2 3 4 5 6 7 8 9 10 11 12 13 14 15 16 17 18
Ticket Resolution Summary Owner Reporter
#61 fixed opening a ticket for CoinUtils fails somebody stefan
Description

Hi,

when I try to create a ticket for CoinUtils, I get error 501:

Method Not Implemented

POST to /cgi-bin/tracwrap.cgi/newticket not supported.
Apache/2.2.0 (Fedora) Server at projects.coin-or.org Port 443

I thought it would be just temporarily, but it's for at least a week like this now.

Stefan

#77 fixed mingw32 cross-compiling fortran handling bug andreasw bubla
Description

Hello, if I run ./configure --host=i486-mingw32 and I have gcc-fortran installed, the configure script fails at certain point. The reason for this most likely is that it detects my (native) fortran compiler, that is useless when actually cross-compiling. I attach CoinUtils?'s config.log, where the error occurs.

I know that you are working on the build system and actually I would like to participate, so regard this more as a reminder than as a task.

#103 migrated mingw32 cross-compiling cbc fail int stefan ikus060
Description

I do have problem to cross-compile cbc for windows using mingw32 on debian wheezy. On a fresh install, I've proceed as follow:

sudo apt-get install subversion build-essential gcc-mingw-w64 mingw-w64 mingw32
svn co https://projects.coin-or.org/svn/Cbc/stable/2.8 coin-cbc-2.8
cd coin-cbc-2.8
./configure --host=i686-w64-mingw32
make

make failed with the following error:

CoinOslFactorization.cpp: In function 'void* clp_align(void*)':
CoinOslFactorization.cpp:901:5: error: 'int64_t' was not declared in this scope
CoinOslFactorization.cpp:901:15: error: expected ';' before 'k'
CoinOslFactorization.cpp:902:10: error: 'k' was not declared in this scope
CoinFinite.hpp: At global scope:
CoinFinite.hpp:18:14: warning: 'COIN_DBL_MAX' defined but not used [-Wunused-variable]
CoinFinite.hpp:20:14: warning: 'COIN_INT_MAX_AS_DOUBLE' defined but not used [-Wunused-variable]
make[3]: *** [CoinOslFactorization.lo] Error 1
make[3]: Leaving directory `/home/debian/coin-cbc-2.8/CoinUtils/src'
make[2]: *** [all] Error 2
make[2]: Leaving directory `/home/debian/coin-cbc-2.8/CoinUtils/src'
make[1]: *** [all-recursive] Error 1
make[1]: Leaving directory `/home/debian/coin-cbc-2.8/CoinUtils'
make: *** [all-recursive] Error 1

Attached is my config.log

1 2 3 4 5 6 7 8 9 10 11 12 13 14 15 16 17 18
Note: See TracQuery for help on using queries.