Custom Query (122 matches)

Filters
 
Or
 
  
 
Columns

Show under each result:


Results (73 - 75 of 122)

Ticket Resolution Summary Owner Reporter
#101 wontfix Probleme bei make stefan katia_kr
Description

I would like to compile ipopt with hsl libraries using cygwin.

The configure command ends with successfull message. But the make and make install commands fail:

/usr/lib/gcc/i686-pc-cygwin/3.4.4/libstdc++.a(eh_terminate.o):(.text+0x1e5): undefined reference to `_w32_sharedptr_terminate' /usr/lib/gcc/i686-pc-cygwin/3.4.4/libstdc++.a(eh_terminate.o):(.text+0x205): undefined reference to `_w32_sharedptr_unexpected' collect2: ld returned 1 exit status make[3]: * [ipopt.exe] Error 1 make[3]: Leaving directory `/cygdrive/c/cygwin/home/katia/ipopt/Ipopt/src/Apps/AmplSolver' make[2]: * [all-recursive] Error 1 make[2]: Leaving directory `/cygdrive/c/cygwin/home/katia/ipopt/Ipopt/src/Apps' make[1]: * [all-recursive] Error 1 make[1]: Leaving directory `/cygdrive/c/cygwin/home/katia/ipopt/Ipopt' make: * [all-recursive] Error 1

Whould could be a problem?..

#30 fixed Problem building MSVC v8 andreasw hpwalton
Description

I'm trying to start the binary build for MSVC v8.

I'm able to build using MSVisualStudio/v8/Cbc/Cbc.sln using: devenv Cbc.sln /Build Release 2>&1 > c:\opensource\buildtools\Cbc_release_out.txt

I have cygwin as well. I am able to do this: ./configure CXX=CL.EXE LD=LINK.EXE then: make 2>&1 | tee make.out Here is the tail of make.out. Linking seems to fail:

...
[ lots of build warnings and other messages ]
...
/bin/sh ../libtool --tag=CXX --mode=link CL.EXE  -O  -DNDEBUG      -o libCoinUtils.la -rpath /cygdrive/c/opensource/Cbc/lib  CoinBuild.lo CoinDenseVector.lo CoinError.lo CoinFactorization1.lo CoinFactorization2.lo CoinFactorization3.lo CoinFactorization4.lo CoinFileIO.lo CoinIndexedVector.lo CoinLpIO.lo CoinMessage.lo CoinMessageHandler.lo CoinModel.lo CoinModelUseful.lo CoinModelUseful2.lo CoinMpsIO.lo CoinPackedMatrix.lo CoinPackedVector.lo CoinPackedVectorBase.lo CoinPostsolveMatrix.lo CoinPrePostsolveMatrix.lo CoinPresolveDoubleton.lo CoinPresolveDual.lo CoinPresolveDupcol.lo CoinPresolveEmpty.lo CoinPresolveFixed.lo CoinPresolveForcing.lo CoinPresolveHelperFunctions.lo CoinPresolveImpliedFree.lo CoinPresolveIsolated.lo CoinPresolveMatrix.lo CoinPresolvePsdebug.lo CoinPresolveSingleton.lo CoinPresolveSubst.lo CoinPresolveTighten.lo CoinPresolveTripleton.lo CoinPresolveUseless.lo CoinPresolveZeros.lo CoinShallowPackedVector.lo CoinWarmStartBasis.lo CoinWarmStartDual.lo  
mkdir .libs
libtool: link: warning: undefined symbols not allowed in i686-pc-cygwin shared libraries
false cru .libs/libCoinUtils.a  CoinBuild.obj CoinDenseVector.obj CoinError.obj CoinFactorization1.obj CoinFactorization2.obj CoinFactorization3.obj CoinFactorization4.obj CoinFileIO.obj CoinIndexedVector.obj CoinLpIO.obj CoinMessage.obj CoinMessageHandler.obj CoinModel.obj CoinModelUseful.obj CoinModelUseful2.obj CoinMpsIO.obj CoinPackedMatrix.obj CoinPackedVector.obj CoinPackedVectorBase.obj CoinPostsolveMatrix.obj CoinPrePostsolveMatrix.obj CoinPresolveDoubleton.obj CoinPresolveDual.obj CoinPresolveDupcol.obj CoinPresolveEmpty.obj CoinPresolveFixed.obj CoinPresolveForcing.obj CoinPresolveHelperFunctions.obj CoinPresolveImpliedFree.obj CoinPresolveIsolated.obj CoinPresolveMatrix.obj CoinPresolvePsdebug.obj CoinPresolveSingleton.obj CoinPresolveSubst.obj CoinPresolveTighten.obj CoinPresolveTripleton.obj CoinPresolveUseless.obj CoinPresolveZeros.obj CoinShallowPackedVector.obj CoinWarmStartBasis.obj CoinWarmStartDual.obj
make[2]: *** [libCoinUtils.la] Error 1
make[2]: Leaving directory `/cygdrive/c/opensource/Cbc/CoinUtils/src'
make[1]: *** [all-recursive] Error 1
make[1]: Leaving directory `/cygdrive/c/opensource/Cbc/CoinUtils'
make: *** [all-recursive] Error 1
#8 wontfix OSI unitTest failure: -fomit-frame-pointer fails, g++ 3.3.1, SuSE 2.4.21-303-smp4G somebody lou
Description

The OSI unitTest dumps core on throws when built with -fomit-frame-pointer. Build environment is g++ 3.3.1, SuSE Linux 2.4.21-303-smpG4. When all components are rebuilt with identical options except for -fomit-frame-pointer, all is copacetic. Seems likely this is a problem with GCC. Testing is annoying --- OsiSolverInterfaceTest.cpp requires 15 minutes to compile in this environment.

Note: See TracQuery for help on using queries.